SN,Age,Gender,comorbidity,Hypertension,Diabetes_mellitus,COPD,CKD,Stroke,CVD_otherthan_HTN,Hypothyroidism,Others,Smoking_yesno,Pack_year,Firewood_exposure,COVID_vaccine,Duration_of_PCR_positive_status,Initial_admission,Diagnosis,HRCT_score,Oxygen_therapy_during_COVID,Fatigue,Anxiety_fear,Depressed_mood,Shortness_of_breath,Palpitations,Joint_pain,Persistnet_ageusia_anosmia,Tinnitus,Blurring_of_vision,Intermittent_fever,Cough,Headache,Chestpain,Other_symptoms,Oxy_req_postcovidperiod,Day_1_modeO2,First_day_flow,Day_2_modeO2,Second_day_flow,Day_3_modeO2,Third_day_flow,Day_4_modeO2,Fourth_day_flow,Day_5_modeO2,Fifth_day_flow,Day_6_modeO2,Sixth_day_flow,Day_7_modeO2,Seventh_day_flow,Day_8_modeO2,Eighth_day_flow,Day_9_modeO2,Ninth_day_flow,Day_10_modeO2,Tenth_day_flow,Day_11_modeO2,Eleventh_day_flow,Day_12_modeO2,Twelfth_day_flow,Day_13_modeO2,Thirteenth_day_flow,Day_14_modeO2,Fourteenth_day_flow,Day_15_modeO2,Fifteenth_day_flow,Duration_oxygen_therapy_postcovid_period,Complications_postcovidward,Discharge_oxygenornot,Discharge_postcovid_symptoms,symptom_at_discharge,Age_cat
3.0,58.0,0.0,0.0,0.0,0.0,0.0,0.0,0.0,0.0,0.0,0.0,0.0,,0.0,0.0,4.0,0.0,0.0,,,0.0,0.0,0.0,0.0,0.0,0.0,0.0,0.0,0.0,0.0,0.0,0.0,0.0,0.0,1.0,0.0,3.0,0.0,3.0,0.0,2.0,0.0,2.0,0.0,2.0,0.0,2.0,0.0,2.0,,,,,,,,,,,,,,,,,7.0,,0.0,0.0,,1.0
9.0,59.0,0.0,0.0,0.0,0.0,0.0,0.0,0.0,0.0,0.0,0.0,0.0,,0.0,0.0,15.0,0.0,0.0,,0.0,0.0,0.0,0.0,1.0,0.0,0.0,0.0,0.0,0.0,0.0,0.0,0.0,0.0,0.0,1.0,0.0,2.0,0.0,1.0,0.0,5.0,0.0,3.0,,,,,,,,,,,,,,,,,,,,,,,5.0,,0.0,0.0,,1.0
47.0,47.0,0.0,0.0,0.0,0.0,0.0,0.0,0.0,0.0,0.0,0.0,0.0,,0.0,0.0,15.0,1.0,0.0,,0.0,0.0,0.0,0.0,0.0,0.0,0.0,0.0,0.0,0.0,0.0,0.0,0.0,0.0,0.0,1.0,0.0,2.0,,,,,,,,,,,,,,,,,,,,,,,,,,,,,2.0,,0.0,0.0,,1.0
110.0,50.0,0.0,0.0,0.0,0.0,0.0,0.0,0.0,0.0,0.0,0.0,0.0,,0.0,0.0,15.0,0.0,0.0,,0.0,0.0,0.0,0.0,1.0,0.0,0.0,0.0,0.0,0.0,0.0,0.0,0.0,0.0,0.0,1.0,0.0,,0.0,,,,,,,,,,,,,,,,,,,,,,,,,,,,2.0,,0.0,0.0,,1.0
31.0,71.0,0.0,0.0,0.0,0.0,0.0,0.0,0.0,0.0,0.0,0.0,0.0,,0.0,0.0,22.0,0.0,0.0,,,0.0,0.0,0.0,0.0,0.0,0.0,0.0,0.0,0.0,0.0,1.0,0.0,0.0,0.0,0.0,,,,,,,,,,,,,,,,,,,,,,,,,,,,,,,1.0,,0.0,0.0,,2.0
49.0,71.0,0.0,0.0,0.0,0.0,0.0,0.0,0.0,0.0,0.0,0.0,0.0,,0.0,0.0,22.0,0.0,0.0,,,1.0,0.0,0.0,0.0,0.0,0.0,0.0,0.0,0.0,0.0,0.0,0.0,0.0,0.0,0.0,,,,,,,,,,,,,,,,,,,,,,,,,,,,,,,1.0,,0.0,0.0,,2.0
80.0,65.0,0.0,0.0,0.0,0.0,0.0,0.0,0.0,0.0,0.0,0.0,0.0,,0.0,0.0,14.0,0.0,0.0,,0.0,1.0,0.0,0.0,0.0,0.0,0.0,0.0,0.0,0.0,0.0,0.0,0.0,1.0,0.0,1.0,0.0,2.0,0.0,2.0,0.0,2.0,0.0,2.0,0.0,2.0,0.0,2.0,,,,,,,,,,,,,,,,,,,7.0,,0.0,0.0,,2.0
6.0,60.0,1.0,0.0,0.0,0.0,0.0,0.0,0.0,0.0,0.0,0.0,0.0,,0.0,0.0,10.0,0.0,0.0,,,1.0,0.0,0.0,0.0,0.0,0.0,0.0,0.0,0.0,0.0,0.0,0.0,0.0,0.0,0.0,,,,,,,,,,,,,,,,,,,,,,,,,,,,,,,2.0,,0.0,0.0,,1.0
14.0,52.0,1.0,0.0,0.0,0.0,0.0,0.0,0.0,0.0,0.0,0.0,0.0,,0.0,0.0,20.0,0.0,0.0,,0.0,1.0,0.0,0.0,1.0,0.0,0.0,0.0,0.0,0.0,0.0,0.0,0.0,0.0,0.0,1.0,0.0,2.0,0.0,2.0,0.0,2.0,0.0,2.0,0.0,2.0,,,,,,,,,,,,,,,,,,,,,6.0,,0.0,0.0,,1.0
62.0,60.0,1.0,0.0,0.0,0.0,0.0,0.0,0.0,0.0,0.0,0.0,0.0,,0.0,0.0,10.0,0.0,0.0,,,1.0,0.0,0.0,0.0,0.0,0.0,0.0,0.0,0.0,0.0,0.0,0.0,0.0,0.0,0.0,,,,,,,,,,,,,,,,,,,,,,,,,,,,,,,2.0,,0.0,0.0,,1.0
109.0,47.0,1.0,0.0,0.0,0.0,0.0,0.0,0.0,0.0,0.0,0.0,0.0,,0.0,0.0,18.0,0.0,0.0,,0.0,0.0,0.0,0.0,1.0,0.0,0.0,0.0,0.0,0.0,0.0,1.0,0.0,0.0,0.0,1.0,0.0,,0.0,,0.0,,,,,,,,,,,,,,,,,,,,,,,,,,3.0,,0.0,0.0,,1.0
20.0,60.0,0.0,1.0,1.0,0.0,0.0,0.0,0.0,0.0,0.0,0.0,0.0,,0.0,0.0,10.0,0.0,0.0,,0.0,0.0,0.0,0.0,1.0,0.0,0.0,0.0,0.0,0.0,0.0,0.0,0.0,0.0,1.0,1.0,0.0,2.0,0.0,1.0,,,,,,,,,,,,,,,,,,,,,,,,,,,3.0,,0.0,0.0,,1.0
61.0,52.0,0.0,1.0,1.0,0.0,0.0,0.0,0.0,0.0,0.0,0.0,0.0,,0.0,0.0,5.0,0.0,0.0,,0.0,0.0,0.0,0.0,1.0,0.0,0.0,0.0,0.0,0.0,0.0,0.0,0.0,0.0,0.0,1.0,0.0,2.0,0.0,2.0,0.0,2.0,0.0,4.0,0.0,2.0,0.0,2.0,,,,,,,,,,,,,,,,,,,7.0,,0.0,0.0,,1.0
65.0,48.0,0.0,1.0,1.0,0.0,0.0,0.0,0.0,0.0,0.0,0.0,0.0,,0.0,0.0,7.0,2.0,0.0,,0.0,1.0,0.0,0.0,0.0,0.0,0.0,0.0,0.0,0.0,0.0,0.0,0.0,0.0,0.0,1.0,0.0,2.0,0.0,2.0,0.0,2.0,0.0,2.0,,,,,,,,,,,,,,,,,,,,,,,5.0,,0.0,0.0,,1.0
75.0,61.0,1.0,1.0,1.0,0.0,0.0,0.0,0.0,0.0,0.0,0.0,0.0,,0.0,0.0,16.0,0.0,0.0,,0.0,0.0,0.0,0.0,0.0,1.0,0.0,0.0,0.0,0.0,0.0,0.0,0.0,1.0,0.0,1.0,0.0,3.0,0.0,3.0,,,,,,,,,,,,,,,,,,,,,,,,,,,5.0,,0.0,0.0,,2.0
51.0,55.0,0.0,1.0,1.0,1.0,0.0,0.0,0.0,0.0,0.0,0.0,0.0,,0.0,0.0,11.0,0.0,0.0,,1.0,1.0,0.0,0.0,1.0,0.0,0.0,0.0,0.0,0.0,0.0,1.0,0.0,0.0,0.0,1.0,0.0,2.0,0.0,2.0,0.0,2.0,0.0,2.0,,,,,,,,,,,,,,,,,,,,,,,6.0,,0.0,0.0,,1.0
33.0,76.0,0.0,1.0,1.0,0.0,1.0,0.0,0.0,0.0,0.0,0.0,0.0,,0.0,0.0,6.0,0.0,0.0,,,0.0,0.0,0.0,0.0,0.0,0.0,0.0,0.0,0.0,0.0,1.0,0.0,0.0,1.0,1.0,1.0,5.0,1.0,5.0,1.0,5.0,1.0,6.0,1.0,5.0,,,,,,,,,,,,,,,,,,,,,5.0,,1.0,0.0,,2.0
16.0,62.0,1.0,1.0,1.0,0.0,1.0,0.0,0.0,0.0,0.0,0.0,0.0,,0.0,0.0,11.0,0.0,0.0,,0.0,1.0,0.0,0.0,1.0,0.0,0.0,0.0,0.0,0.0,0.0,0.0,0.0,0.0,0.0,1.0,0.0,4.0,0.0,4.0,0.0,4.0,0.0,4.0,0.0,2.0,0.0,2.0,0.0,2.0,0.0,2.0,0.0,1.0,0.0,2.0,,,,,,,,,,,10.0,,1.0,1.0,shortness of breath on exertion,2.0
15.0,64.0,0.0,1.0,0.0,0.0,0.0,0.0,0.0,1.0,0.0,0.0,0.0,,0.0,0.0,14.0,0.0,0.0,,0.0,1.0,0.0,0.0,1.0,0.0,0.0,0.0,0.0,0.0,1.0,1.0,0.0,0.0,0.0,1.0,0.0,4.0,0.0,4.0,0.0,2.0,0.0,2.0,0.0,2.0,0.0,2.0,0.0,2.0,0.0,2.0,,,,,,,,,,,,,,,11.0,,0.0,0.0,,2.0
25.0,75.0,1.0,1.0,1.0,1.0,0.0,0.0,0.0,1.0,0.0,0.0,0.0,,0.0,0.0,25.0,0.0,0.0,,,0.0,0.0,0.0,1.0,0.0,0.0,0.0,0.0,0.0,0.0,0.0,0.0,0.0,1.0,1.0,0.0,1.0,0.0,1.0,,,,,,,,,,,,,,,,,,,,,,,,,,,4.0,,0.0,0.0,,2.0
28.0,64.0,0.0,1.0,0.0,0.0,0.0,0.0,0.0,0.0,1.0,0.0,0.0,,0.0,0.0,16.0,0.0,0.0,,0.0,0.0,0.0,0.0,0.0,0.0,0.0,0.0,0.0,0.0,1.0,1.0,1.0,0.0,0.0,1.0,0.0,2.0,0.0,2.0,0.0,2.0,,,,,,,,,,,,,,,,,,,,,,,,,4.0,,0.0,0.0,,2.0
56.0,45.0,1.0,1.0,0.0,0.0,0.0,0.0,0.0,0.0,0.0,1.0,0.0,,0.0,0.0,10.0,0.0,0.0,,,0.0,0.0,0.0,0.0,0.0,0.0,0.0,0.0,0.0,0.0,0.0,0.0,0.0,0.0,0.0,,,,,,,,,,,,,,,,,,,,,,,,,,,,,,,3.0,,0.0,0.0,,1.0
57.0,56.0,0.0,1.0,1.0,0.0,0.0,0.0,0.0,0.0,0.0,1.0,0.0,,0.0,0.0,20.0,0.0,0.0,,0.0,0.0,0.0,0.0,1.0,0.0,0.0,0.0,0.0,0.0,0.0,1.0,0.0,0.0,0.0,1.0,0.0,1.0,,,,,,,,,,,,,,,,,,,,,,,,,,,,,3.0,,0.0,0.0,,1.0
43.0,60.0,0.0,1.0,0.0,0.0,0.0,1.0,0.0,0.0,0.0,1.0,0.0,,0.0,0.0,9.0,0.0,0.0,,,1.0,1.0,0.0,0.0,0.0,0.0,1.0,0.0,0.0,0.0,1.0,0.0,0.0,1.0,0.0,,,,,,,,,,,,,,,,,,,,,,,,,,,,,,,4.0,,0.0,0.0,,1.0
70.0,61.0,0.0,1.0,0.0,0.0,1.0,0.0,0.0,0.0,0.0,0.0,1.0,30.0,0.0,0.0,18.0,0.0,0.0,6.0,1.0,0.0,0.0,0.0,1.0,0.0,0.0,0.0,0.0,0.0,0.0,1.0,0.0,1.0,1.0,1.0,0.0,4.0,0.0,4.0,0.0,4.0,0.0,4.0,0.0,4.0,0.0,2.0,0.0,2.0,0.0,2.0,,,,,,,,,,,,,,,9.0,,1.0,1.0,shortness of breath,2.0
44.0,83.0,0.0,0.0,0.0,0.0,0.0,0.0,0.0,0.0,0.0,1.0,1.0,20.0,0.0,0.0,11.0,1.0,0.0,,,0.0,0.0,0.0,0.0,0.0,0.0,1.0,0.0,0.0,0.0,0.0,0.0,0.0,0.0,0.0,,,,,,,,,,,,,,,,,,,,,,,,,,,,,,,1.0,,0.0,0.0,,2.0
2.0,51.0,1.0,1.0,0.0,0.0,0.0,0.0,0.0,0.0,0.0,1.0,0.0,,1.0,0.0,6.0,0.0,0.0,,,1.0,0.0,0.0,0.0,0.0,0.0,0.0,0.0,0.0,0.0,0.0,0.0,0.0,0.0,0.0,,,,,,,,,,,,,,,,,,,,,,,,,,,,,,,3.0,,0.0,0.0,,1.0
72.0,70.0,1.0,1.0,0.0,0.0,1.0,0.0,0.0,0.0,0.0,0.0,1.0,60.0,1.0,0.0,20.0,1.0,0.0,,0.0,1.0,0.0,0.0,1.0,0.0,0.0,0.0,0.0,0.0,0.0,0.0,0.0,0.0,1.0,0.0,,,,,,,,,,,,,,,,,,,,,,,,,,,,,,,3.0,,0.0,0.0,,2.0
97.0,84.0,1.0,1.0,0.0,0.0,1.0,1.0,0.0,0.0,0.0,0.0,1.0,22.0,1.0,0.0,11.0,1.0,0.0,,0.0,1.0,0.0,0.0,1.0,0.0,0.0,1.0,0.0,0.0,0.0,1.0,0.0,0.0,1.0,1.0,0.0,3.0,0.0,3.0,0.0,2.0,0.0,2.0,0.0,2.0,0.0,2.0,0.0,2.0,0.0,2.0,0.0,2.0,0.0,2.0,,,,,,,,,,,10.0,,1.0,1.0,"anosmia,SOB, cough",2.0
26.0,84.0,0.0,1.0,1.0,0.0,1.0,0.0,0.0,1.0,0.0,1.0,1.0,10.0,1.0,0.0,8.0,2.0,0.0,,0.0,0.0,0.0,0.0,1.0,0.0,0.0,0.0,0.0,0.0,0.0,0.0,0.0,0.0,0.0,1.0,0.0,2.0,0.0,2.0,0.0,2.0,0.0,1.0,0.0,1.0,0.0,1.0,,,,,,,,,,,,,,,,,,,6.0,,0.0,0.0,,2.0
7.0,31.0,0.0,0.0,0.0,0.0,0.0,0.0,0.0,0.0,0.0,0.0,0.0,,0.0,0.0,11.0,1.0,2.0,,0.0,1.0,0.0,0.0,1.0,0.0,0.0,0.0,0.0,0.0,0.0,0.0,0.0,0.0,0.0,1.0,0.0,3.0,0.0,3.0,,,,,,,,,,,,,,,,,,,,,,,,,,,3.0,,0.0,0.0,,1.0
18.0,41.0,0.0,0.0,0.0,0.0,0.0,0.0,0.0,0.0,0.0,0.0,0.0,,0.0,0.0,13.0,0.0,2.0,,2.0,0.0,0.0,0.0,1.0,0.0,0.0,0.0,0.0,0.0,0.0,0.0,0.0,0.0,0.0,1.0,1.0,,1.0,8.0,1.0,8.0,1.0,8.0,1.0,8.0,1.0,8.0,0.0,2.0,0.0,2.0,,,,,,,,,,,,,,,9.0,,0.0,0.0,,1.0
40.0,18.0,0.0,0.0,0.0,0.0,0.0,0.0,0.0,0.0,0.0,0.0,0.0,,0.0,0.0,14.0,2.0,2.0,14.0,1.0,0.0,0.0,0.0,1.0,0.0,0.0,0.0,0.0,0.0,0.0,1.0,0.0,1.0,1.0,1.0,1.0,5.0,1.0,5.0,0.0,4.0,0.0,4.0,0.0,4.0,0.0,4.0,0.0,4.0,0.0,3.0,0.0,4.0,0.0,3.0,0.0,1.0,,,,,,,,,14.0,,0.0,1.0,"weakness, fatigue",1.0
85.0,55.0,0.0,0.0,0.0,0.0,0.0,0.0,0.0,0.0,0.0,0.0,0.0,,0.0,0.0,10.0,1.0,2.0,,2.0,0.0,0.0,0.0,0.0,0.0,0.0,0.0,0.0,0.0,0.0,0.0,0.0,0.0,0.0,1.0,0.0,5.0,0.0,3.0,0.0,2.0,,,,,,,,,,,,,,,,,,,,,,,,,4.0,,0.0,0.0,,1.0
88.0,50.0,0.0,0.0,0.0,0.0,0.0,0.0,0.0,0.0,0.0,0.0,0.0,,0.0,0.0,16.0,2.0,2.0,,1.0,0.0,0.0,0.0,1.0,0.0,0.0,0.0,0.0,0.0,0.0,0.0,0.0,0.0,0.0,1.0,2.0,10.0,2.0,10.0,2.0,10.0,2.0,10.0,2.0,10.0,0.0,2.0,0.0,2.0,0.0,2.0,0.0,3.0,2.0,8.0,2.0,8.0,2.0,8.0,0.0,4.0,0.0,2.0,0.0,2.0,19.0,,0.0,1.0,epigastric pain,1.0
12.0,68.0,0.0,0.0,0.0,0.0,0.0,0.0,0.0,0.0,0.0,0.0,0.0,,0.0,0.0,10.0,1.0,2.0,16.0,1.0,1.0,0.0,0.0,1.0,0.0,0.0,0.0,0.0,0.0,0.0,1.0,0.0,0.0,0.0,1.0,1.0,5.0,1.0,5.0,1.0,5.0,1.0,5.0,1.0,5.0,1.0,5.0,1.0,5.0,0.0,2.0,0.0,2.0,0.0,2.0,0.0,1.0,,,,,,,,,12.0,,0.0,0.0,,2.0
27.0,69.0,0.0,0.0,0.0,0.0,0.0,0.0,0.0,0.0,0.0,0.0,0.0,,0.0,0.0,5.0,2.0,2.0,13.0,1.0,0.0,0.0,0.0,0.0,0.0,0.0,0.0,0.0,0.0,0.0,1.0,0.0,0.0,0.0,1.0,0.0,3.0,0.0,3.0,0.0,2.0,0.0,1.0,,,,,,,,,,,,,,,,,,,,,,,5.0,,0.0,1.0,dry cough,2.0
78.0,69.0,0.0,0.0,0.0,0.0,0.0,0.0,0.0,0.0,0.0,0.0,0.0,,0.0,0.0,19.0,0.0,2.0,,0.0,1.0,0.0,0.0,0.0,0.0,0.0,0.0,0.0,0.0,0.0,0.0,0.0,0.0,0.0,1.0,0.0,2.0,0.0,2.0,0.0,1.0,,,,,,,,,,,,,,,,,,,,,,,,,6.0,,0.0,0.0,,2.0
36.0,59.0,1.0,0.0,0.0,0.0,0.0,0.0,0.0,0.0,0.0,0.0,0.0,,0.0,0.0,11.0,0.0,2.0,17.0,,0.0,0.0,0.0,0.0,0.0,0.0,0.0,0.0,0.0,0.0,0.0,0.0,1.0,1.0,1.0,0.0,2.0,0.0,2.0,0.0,2.0,,,,,,,,,,,,,,,,,,,,,,,,,3.0,,1.0,1.0,chest pain,1.0
79.0,42.0,1.0,0.0,0.0,0.0,0.0,0.0,0.0,0.0,0.0,0.0,0.0,,0.0,0.0,11.0,0.0,2.0,,0.0,1.0,0.0,0.0,0.0,0.0,0.0,0.0,0.0,0.0,0.0,0.0,0.0,0.0,0.0,1.0,0.0,2.0,0.0,2.0,,,,,,,,,,,,,,,,,,,,,,,,,,,3.0,,0.0,0.0,,1.0
63.0,74.0,1.0,0.0,0.0,0.0,0.0,0.0,0.0,0.0,0.0,0.0,0.0,,0.0,0.0,10.0,1.0,2.0,,0.0,0.0,0.0,0.0,1.0,0.0,0.0,0.0,0.0,0.0,0.0,1.0,0.0,0.0,0.0,1.0,0.0,2.0,0.0,2.0,,,,,,,,,,,,,,,,,,,,,,,,,,,3.0,,0.0,0.0,,2.0
74.0,55.0,0.0,1.0,1.0,0.0,0.0,0.0,0.0,0.0,0.0,0.0,0.0,,0.0,0.0,10.0,0.0,2.0,,0.0,1.0,0.0,0.0,0.0,0.0,0.0,0.0,0.0,0.0,0.0,0.0,0.0,0.0,0.0,0.0,,,,,,,,,,,,,,,,,,,,,,,,,,,,,,,2.0,,0.0,0.0,,1.0
53.0,36.0,1.0,1.0,1.0,0.0,0.0,0.0,0.0,0.0,0.0,0.0,0.0,,0.0,0.0,14.0,2.0,2.0,13.0,0.0,0.0,0.0,0.0,1.0,0.0,0.0,0.0,0.0,0.0,0.0,1.0,0.0,0.0,1.0,1.0,0.0,2.0,0.0,2.0,0.0,2.0,,,,,,,,,,,,,,,,,,,,,,,,,4.0,,0.0,1.0,backache,1.0
81.0,44.0,1.0,1.0,1.0,0.0,0.0,0.0,0.0,0.0,0.0,0.0,0.0,,0.0,0.0,19.0,0.0,2.0,,4.0,1.0,0.0,0.0,0.0,0.0,0.0,0.0,0.0,0.0,0.0,0.0,1.0,0.0,0.0,1.0,2.0,10.0,2.0,10.0,0.0,2.0,,,,,,,,,,,,,,,,,,,,,,,,,4.0,,0.0,0.0,,1.0
107.0,66.0,1.0,1.0,1.0,0.0,0.0,0.0,0.0,0.0,0.0,0.0,0.0,,0.0,0.0,15.0,1.0,2.0,16.0,2.0,1.0,0.0,0.0,1.0,1.0,0.0,0.0,0.0,0.0,1.0,1.0,0.0,0.0,0.0,1.0,1.0,,1.0,,1.0,,0.0,,0.0,,0.0,,0.0,,0.0,,0.0,,0.0,,,,,,,,,,,,10.0,,0.0,0.0,,2.0
10.0,38.0,0.0,1.0,1.0,1.0,0.0,0.0,0.0,0.0,0.0,0.0,0.0,,0.0,0.0,18.0,1.0,2.0,14.0,,1.0,0.0,0.0,1.0,0.0,0.0,0.0,0.0,0.0,0.0,0.0,0.0,1.0,0.0,0.0,,,,,,,,,,,,,,,,,,,,,,,,,,,,,,,3.0,,0.0,0.0,,1.0
76.0,55.0,0.0,1.0,1.0,1.0,0.0,0.0,0.0,0.0,0.0,0.0,0.0,,0.0,0.0,15.0,0.0,2.0,11.0,,1.0,0.0,0.0,0.0,0.0,0.0,0.0,0.0,0.0,0.0,0.0,0.0,0.0,1.0,0.0,,,,,,,,,,,,,,,,,,,,,,,,,,,,,,,6.0,,0.0,0.0,,1.0
48.0,65.0,0.0,1.0,1.0,1.0,0.0,0.0,0.0,0.0,0.0,0.0,0.0,,0.0,0.0,9.0,0.0,2.0,,1.0,0.0,0.0,0.0,0.0,0.0,0.0,0.0,0.0,0.0,0.0,1.0,0.0,0.0,0.0,1.0,0.0,4.0,0.0,2.0,0.0,2.0,,,,,,,,,,,,,,,,,,,,,,,,,4.0,,0.0,0.0,,2.0
55.0,70.0,0.0,1.0,1.0,1.0,0.0,0.0,0.0,0.0,0.0,0.0,0.0,,0.0,0.0,10.0,2.0,2.0,14.0,1.0,0.0,0.0,0.0,0.0,0.0,0.0,0.0,0.0,0.0,0.0,0.0,0.0,0.0,1.0,1.0,1.0,5.0,0.0,4.0,0.0,4.0,,,,,,,,,,,,,,,,,,,,,,,,,5.0,,0.0,0.0,,2.0
59.0,62.0,1.0,1.0,0.0,0.0,1.0,0.0,0.0,0.0,0.0,0.0,0.0,,0.0,0.0,13.0,0.0,2.0,,1.0,0.0,0.0,0.0,1.0,0.0,1.0,0.0,0.0,0.0,0.0,0.0,0.0,0.0,0.0,1.0,1.0,7.0,1.0,8.0,0.0,3.0,0.0,3.0,1.0,8.0,1.0,5.0,1.0,8.0,0.0,2.0,0.0,2.0,0.0,2.0,0.0,2.0,0.0,2.0,,,,,,,12.0,,1.0,0.0,,2.0
92.0,65.0,0.0,1.0,1.0,1.0,1.0,0.0,0.0,0.0,0.0,0.0,0.0,,0.0,0.0,15.0,1.0,2.0,,0.0,1.0,0.0,0.0,0.0,0.0,0.0,1.0,0.0,0.0,0.0,1.0,0.0,0.0,1.0,1.0,0.0,2.0,,,,,,,,,,,,,,,,,,,,,,,,,,,,,4.0,,0.0,0.0,,2.0
19.0,56.0,0.0,1.0,0.0,0.0,0.0,0.0,0.0,1.0,0.0,0.0,0.0,,0.0,0.0,10.0,1.0,2.0,,1.0,0.0,0.0,0.0,1.0,0.0,0.0,0.0,0.0,0.0,0.0,0.0,0.0,0.0,0.0,1.0,0.0,2.0,0.0,2.0,0.0,2.0,,,,,,,,,,,,,,,,,,,,,,,,,3.0,,0.0,0.0,,1.0
89.0,38.0,1.0,1.0,0.0,1.0,0.0,0.0,0.0,1.0,0.0,0.0,0.0,,0.0,0.0,12.0,1.0,2.0,,0.0,0.0,0.0,0.0,0.0,0.0,0.0,0.0,0.0,0.0,0.0,0.0,0.0,1.0,0.0,1.0,0.0,2.0,0.0,2.0,,,,,,,,,,,,,,,,,,,,,,,,,,,3.0,,0.0,0.0,,1.0
24.0,60.0,0.0,1.0,1.0,1.0,0.0,0.0,0.0,1.0,0.0,0.0,0.0,,0.0,0.0,11.0,3.0,2.0,,0.0,1.0,0.0,0.0,1.0,0.0,0.0,0.0,0.0,0.0,0.0,1.0,0.0,0.0,0.0,1.0,0.0,2.0,0.0,2.0,0.0,2.0,0.0,1.0,0.0,1.0,0.0,1.0,,,,,,,,,,,,,,,,,,,8.0,,0.0,0.0,,1.0
17.0,65.0,0.0,1.0,1.0,1.0,0.0,0.0,0.0,1.0,0.0,0.0,0.0,,0.0,0.0,9.0,0.0,2.0,15.0,1.0,1.0,0.0,0.0,1.0,0.0,1.0,0.0,0.0,0.0,0.0,1.0,0.0,0.0,0.0,1.0,0.0,4.0,0.0,2.0,0.0,2.0,,,,,,,,,,,,,,,,,,,,,,,,,3.0,,1.0,1.0,shortness of breath,2.0
71.0,66.0,0.0,1.0,0.0,0.0,0.0,0.0,0.0,0.0,0.0,1.0,0.0,,0.0,0.0,11.0,0.0,2.0,15.0,1.0,0.0,0.0,0.0,0.0,0.0,0.0,0.0,0.0,0.0,0.0,0.0,0.0,0.0,1.0,1.0,0.0,2.0,0.0,2.0,0.0,2.0,0.0,2.0,0.0,1.0,0.0,1.0,,,,,,,,,,,,,,,,,,,7.0,,0.0,0.0,,2.0
83.0,58.0,0.0,1.0,1.0,0.0,0.0,0.0,0.0,0.0,0.0,1.0,0.0,,0.0,0.0,13.0,1.0,2.0,,2.0,0.0,0.0,0.0,0.0,0.0,0.0,0.0,0.0,0.0,0.0,1.0,0.0,0.0,1.0,1.0,0.0,5.0,0.0,3.0,0.0,2.0,0.0,2.0,0.0,2.0,,,,,,,,,,,,,,,,,,,,,6.0,,0.0,0.0,,1.0
21.0,88.0,0.0,1.0,1.0,0.0,0.0,0.0,0.0,0.0,0.0,1.0,0.0,,0.0,0.0,11.0,1.0,2.0,,0.0,0.0,0.0,0.0,0.0,0.0,0.0,0.0,0.0,0.0,0.0,0.0,0.0,0.0,1.0,1.0,0.0,2.0,0.0,2.0,0.0,2.0,0.0,2.0,0.0,2.0,0.0,2.0,0.0,2.0,0.0,2.0,0.0,1.0,0.0,1.0,,,,,,,,,,,11.0,bowel and bladder urgency,0.0,0.0,,2.0
101.0,76.0,0.0,1.0,0.0,0.0,1.0,0.0,0.0,0.0,0.0,1.0,0.0,,0.0,0.0,14.0,0.0,2.0,15.0,0.0,0.0,0.0,0.0,1.0,0.0,0.0,0.0,0.0,0.0,0.0,1.0,0.0,0.0,1.0,1.0,0.0,2.0,0.0,2.0,0.0,2.0,0.0,2.0,0.0,2.0,0.0,2.0,0.0,2.0,0.0,2.0,0.0,2.0,0.0,3.0,0.0,4.0,0.0,4.0,0.0,4.0,0.0,3.0,0.0,3.0,17.0,"pneumonia, anemia",1.0,1.0,"SOB, cough",2.0
99.0,67.0,1.0,1.0,1.0,0.0,1.0,0.0,0.0,0.0,0.0,1.0,0.0,,0.0,0.0,24.0,3.0,2.0,16.0,2.0,1.0,0.0,0.0,1.0,0.0,0.0,0.0,0.0,0.0,0.0,1.0,1.0,0.0,0.0,1.0,1.0,8.0,0.0,4.0,0.0,4.0,0.0,4.0,0.0,4.0,0.0,3.0,0.0,3.0,0.0,3.0,,,,,0.0,2.0,0.0,2.0,0.0,2.0,0.0,2.0,0.0,2.0,17.0,"seizure, diarrhea",0.0,1.0,excessive fatigue,2.0
67.0,86.0,1.0,1.0,1.0,1.0,1.0,0.0,0.0,1.0,0.0,1.0,0.0,,0.0,0.0,17.0,1.0,2.0,10.0,1.0,0.0,0.0,0.0,1.0,0.0,0.0,0.0,0.0,0.0,0.0,0.0,0.0,0.0,1.0,1.0,0.0,1.0,0.0,4.0,0.0,4.0,0.0,2.0,0.0,2.0,,,,,,,,,,,,,,,,,,,,,6.0,,0.0,0.0,,2.0
82.0,72.0,1.0,1.0,0.0,0.0,1.0,0.0,0.0,1.0,1.0,0.0,1.0,25.0,0.0,0.0,10.0,0.0,2.0,,2.0,1.0,0.0,0.0,1.0,0.0,0.0,0.0,0.0,0.0,0.0,1.0,0.0,0.0,1.0,1.0,1.0,7.0,1.0,7.0,1.0,5.0,1.0,5.0,1.0,5.0,0.0,2.0,0.0,2.0,0.0,2.0,,,0.0,2.0,,,,,,,,,,,11.0,,0.0,1.0,"cough, shortness of breath",2.0
106.0,75.0,1.0,1.0,1.0,0.0,1.0,0.0,0.0,0.0,1.0,0.0,1.0,12.5,1.0,0.0,12.0,2.0,2.0,15.0,2.0,1.0,0.0,0.0,1.0,0.0,0.0,0.0,0.0,0.0,1.0,1.0,0.0,0.0,0.0,1.0,2.0,,2.0,,1.0,,1.0,,0.0,,0.0,,0.0,,0.0,,0.0,,,,,,,,,,,,,,9.0,,0.0,0.0,,2.0
11.0,60.0,0.0,0.0,0.0,0.0,0.0,0.0,0.0,0.0,0.0,0.0,0.0,,0.0,0.0,15.0,2.0,3.0,22.0,4.0,0.0,0.0,0.0,1.0,0.0,0.0,0.0,0.0,0.0,0.0,1.0,0.0,0.0,0.0,1.0,0.0,3.0,0.0,3.0,0.0,2.0,0.0,2.0,0.0,2.0,,,,,,,,,,,,,,,,,,,,,6.0,,0.0,0.0,,1.0
22.0,45.0,0.0,0.0,0.0,0.0,0.0,0.0,0.0,0.0,0.0,0.0,0.0,,0.0,0.0,5.0,2.0,3.0,,2.0,1.0,0.0,0.0,1.0,0.0,0.0,0.0,0.0,0.0,0.0,1.0,0.0,0.0,0.0,1.0,1.0,10.0,1.0,10.0,1.0,10.0,1.0,6.0,0.0,3.0,0.0,3.0,0.0,3.0,0.0,3.0,0.0,3.0,0.0,2.0,0.0,2.0,0.0,1.0,0.0,1.0,,,,,14.0,,0.0,0.0,,1.0
32.0,60.0,0.0,0.0,0.0,0.0,0.0,0.0,0.0,0.0,0.0,0.0,0.0,,0.0,0.0,22.0,1.0,3.0,,0.0,0.0,0.0,0.0,1.0,0.0,0.0,0.0,0.0,0.0,0.0,1.0,0.0,1.0,1.0,1.0,0.0,3.0,0.0,3.0,0.0,2.0,0.0,2.0,0.0,2.0,,,,,,,,,,,,,,,,,,,,,8.0,,0.0,1.0,dry cough,1.0
77.0,44.0,0.0,0.0,0.0,0.0,0.0,0.0,0.0,0.0,0.0,0.0,0.0,,0.0,0.0,18.0,3.0,3.0,20.0,2.0,1.0,0.0,0.0,1.0,0.0,0.0,0.0,0.0,0.0,0.0,0.0,0.0,0.0,0.0,1.0,0.0,2.0,0.0,2.0,,,,,,,,,,,,,,,,,,,,,,,,,,,3.0,,0.0,0.0,,1.0
86.0,32.0,0.0,0.0,0.0,0.0,0.0,0.0,0.0,0.0,0.0,0.0,0.0,,0.0,0.0,14.0,3.0,3.0,,2.0,0.0,0.0,0.0,1.0,0.0,0.0,0.0,0.0,0.0,0.0,0.0,0.0,0.0,0.0,1.0,2.0,15.0,2.0,15.0,2.0,15.0,2.0,12.0,2.0,12.0,2.0,10.0,2.0,10.0,2.0,15.0,2.0,8.0,2.0,15.0,2.0,15.0,1.0,5.0,1.0,4.0,0.0,2.0,0.0,2.0,21.0,,0.0,0.0,,1.0
98.0,33.0,0.0,0.0,0.0,0.0,0.0,0.0,0.0,0.0,0.0,0.0,0.0,,0.0,0.0,19.0,3.0,3.0,17.0,5.0,0.0,0.0,0.0,1.0,0.0,0.0,1.0,0.0,0.0,0.0,1.0,0.0,0.0,0.0,1.0,0.0,2.0,0.0,2.0,,,,,,,,,,,,,,,,,,,,,,,,,,,3.0,,0.0,1.0,"SOB,cough",1.0
103.0,41.0,0.0,0.0,0.0,0.0,0.0,0.0,0.0,0.0,0.0,0.0,0.0,,0.0,0.0,25.0,3.0,3.0,,5.0,0.0,0.0,0.0,1.0,0.0,0.0,0.0,0.0,0.0,0.0,1.0,0.0,0.0,1.0,1.0,0.0,3.0,0.0,3.0,1.0,10.0,0.0,4.0,0.0,4.0,0.0,4.0,0.0,4.0,0.0,2.0,0.0,2.0,0.0,2.0,,,,,,,,,,,10.0,,0.0,0.0,,1.0
1.0,29.0,1.0,0.0,0.0,0.0,0.0,0.0,0.0,0.0,0.0,0.0,0.0,,0.0,0.0,16.0,3.0,3.0,,2.0,1.0,0.0,0.0,1.0,0.0,0.0,1.0,0.0,0.0,0.0,1.0,0.0,0.0,0.0,1.0,1.0,7.0,0.0,3.0,0.0,3.0,0.0,2.0,0.0,2.0,0.0,2.0,,,,,,,,,,,,,,,,,,,6.0,,1.0,1.0,"dry cough, fatigue",1.0
8.0,29.0,1.0,0.0,0.0,0.0,0.0,0.0,0.0,0.0,0.0,0.0,0.0,,0.0,0.0,16.0,3.0,3.0,,1.0,0.0,0.0,0.0,1.0,0.0,0.0,0.0,0.0,0.0,0.0,1.0,1.0,0.0,0.0,1.0,1.0,7.0,0.0,3.0,0.0,3.0,0.0,3.0,0.0,2.0,0.0,2.0,0.0,2.0,,,,,,,,,,,,,,,,,7.0,,1.0,1.0,shortness of breath,1.0
35.0,30.0,1.0,0.0,0.0,0.0,0.0,0.0,0.0,0.0,0.0,0.0,0.0,,0.0,0.0,12.0,2.0,3.0,20.0,,0.0,0.0,0.0,0.0,0.0,0.0,0.0,0.0,0.0,0.0,0.0,0.0,0.0,0.0,1.0,1.0,5.0,1.0,5.0,,,,,,,,,,,,,,,,,,,,,,,,,,,3.0,,0.0,0.0,,1.0
46.0,59.0,1.0,0.0,0.0,0.0,0.0,0.0,0.0,0.0,0.0,0.0,0.0,,0.0,0.0,15.0,0.0,3.0,17.0,1.0,0.0,0.0,0.0,0.0,0.0,0.0,0.0,0.0,0.0,0.0,0.0,0.0,1.0,0.0,1.0,0.0,2.0,,,,,,,,,,,,,,,,,,,,,,,,,,,,,2.0,,0.0,0.0,,1.0
60.0,44.0,1.0,0.0,0.0,0.0,0.0,0.0,0.0,0.0,0.0,0.0,0.0,,0.0,0.0,19.0,3.0,3.0,,0.0,0.0,0.0,0.0,1.0,0.0,0.0,0.0,0.0,0.0,0.0,1.0,0.0,1.0,0.0,1.0,0.0,3.0,0.0,3.0,0.0,3.0,0.0,2.0,0.0,2.0,,,,,,,,,,,,,,,,,,,,,5.0,,1.0,1.0,"shortness of breath, cough",1.0
64.0,36.0,1.0,0.0,0.0,0.0,0.0,0.0,0.0,0.0,0.0,0.0,0.0,,0.0,0.0,14.0,1.0,3.0,25.0,1.0,0.0,0.0,0.0,1.0,0.0,0.0,0.0,0.0,0.0,0.0,1.0,0.0,0.0,0.0,1.0,1.0,8.0,1.0,8.0,1.0,9.0,1.0,9.0,,,,,0.0,2.0,0.0,2.0,0.0,2.0,0.0,2.0,,,,,,,,,,,10.0,,1.0,0.0,,1.0
87.0,45.0,1.0,0.0,0.0,0.0,0.0,0.0,0.0,0.0,0.0,0.0,0.0,,0.0,0.0,5.0,1.0,3.0,21.0,1.0,0.0,0.0,0.0,0.0,0.0,0.0,0.0,0.0,0.0,0.0,0.0,0.0,0.0,0.0,0.0,,,,,,,,,,,,,,,,,,,,,,,,,,,,,,,5.0,,0.0,0.0,,1.0
30.0,70.0,1.0,0.0,0.0,0.0,0.0,0.0,0.0,0.0,0.0,0.0,0.0,,0.0,0.0,20.0,2.0,3.0,18.0,0.0,0.0,0.0,0.0,0.0,0.0,0.0,0.0,0.0,0.0,0.0,1.0,0.0,0.0,0.0,1.0,0.0,2.0,0.0,2.0,0.0,2.0,,,,,,,,,,,,,,,,,,,,,,,,,4.0,,0.0,1.0,dry cough,2.0
5.0,47.0,0.0,1.0,1.0,0.0,0.0,0.0,0.0,0.0,0.0,0.0,0.0,,0.0,0.0,16.0,2.0,3.0,,1.0,1.0,0.0,0.0,0.0,0.0,0.0,0.0,0.0,0.0,0.0,1.0,0.0,0.0,0.0,1.0,0.0,4.0,,,,,,,,,,,,,,,,,,,,,,,,,,,,,2.0,,0.0,0.0,,1.0
52.0,66.0,0.0,1.0,1.0,0.0,0.0,0.0,0.0,0.0,0.0,0.0,0.0,,0.0,0.0,15.0,3.0,3.0,2.0,1.0,1.0,0.0,0.0,1.0,0.0,0.0,0.0,0.0,0.0,1.0,1.0,0.0,0.0,0.0,1.0,1.0,4.0,1.0,4.0,0.0,3.0,0.0,3.0,0.0,1.0,,,,,,,,,,,,,,,,,,,,,6.0,,0.0,1.0,cough,2.0
102.0,69.0,0.0,1.0,1.0,0.0,0.0,0.0,0.0,0.0,0.0,0.0,0.0,,0.0,0.0,19.0,3.0,3.0,,2.0,0.0,0.0,1.0,1.0,0.0,0.0,0.0,0.0,0.0,0.0,0.0,0.0,0.0,1.0,1.0,0.0,4.0,0.0,3.0,0.0,2.0,0.0,3.0,0.0,4.0,,,,,0.0,2.0,0.0,2.0,0.0,3.0,0.0,3.0,0.0,4.0,,,,,,,13.0,postcovid depression,1.0,1.0,postcovid depression,2.0
34.0,64.0,1.0,1.0,1.0,0.0,0.0,0.0,0.0,0.0,0.0,0.0,0.0,,0.0,0.0,19.0,1.0,3.0,19.0,2.0,0.0,0.0,0.0,0.0,0.0,0.0,0.0,0.0,0.0,0.0,1.0,1.0,0.0,1.0,1.0,1.0,10.0,1.0,10.0,1.0,10.0,1.0,5.0,1.0,5.0,1.0,6.0,1.0,4.0,0.0,3.0,0.0,2.0,0.0,2.0,0.0,1.0,0.0,1.0,0.0,1.0,0.0,2.0,0.0,1.0,18.0,,0.0,0.0,,2.0
45.0,53.0,0.0,1.0,0.0,1.0,0.0,0.0,0.0,0.0,0.0,0.0,0.0,,0.0,0.0,11.0,1.0,3.0,16.0,2.0,0.0,0.0,0.0,1.0,0.0,0.0,0.0,0.0,0.0,0.0,0.0,0.0,1.0,0.0,1.0,0.0,2.0,0.0,2.0,,,,,,,,,,,,,,,,,,,,,,,,,,,3.0,,0.0,0.0,,1.0
58.0,57.0,0.0,1.0,0.0,1.0,0.0,0.0,0.0,0.0,0.0,0.0,0.0,,0.0,0.0,11.0,3.0,3.0,17.0,1.0,1.0,0.0,0.0,1.0,0.0,0.0,0.0,0.0,0.0,0.0,0.0,0.0,0.0,0.0,1.0,0.0,3.0,1.0,8.0,1.0,8.0,0.0,,,,,,,,,,,,,,,,,,,,,,,,11.0,,0.0,0.0,,1.0
69.0,50.0,1.0,1.0,1.0,1.0,0.0,0.0,0.0,0.0,0.0,0.0,0.0,,0.0,0.0,21.0,3.0,3.0,18.0,1.0,1.0,1.0,0.0,1.0,0.0,0.0,0.0,0.0,0.0,0.0,1.0,0.0,0.0,1.0,1.0,0.0,3.0,0.0,1.0,0.0,1.0,0.0,1.0,0.0,1.0,0.0,1.0,,,,,,,,,,,,,,,,,,,7.0,,0.0,0.0,,1.0
4.0,62.0,0.0,1.0,1.0,0.0,1.0,1.0,0.0,0.0,0.0,0.0,0.0,,0.0,0.0,9.0,3.0,3.0,16.0,2.0,1.0,0.0,0.0,0.0,0.0,0.0,0.0,0.0,0.0,0.0,0.0,1.0,0.0,0.0,1.0,1.0,6.0,0.0,4.0,0.0,4.0,0.0,2.0,,,,,,,,,,,,,,,,,,,,,,,6.0,,0.0,0.0,,2.0
50.0,62.0,0.0,1.0,1.0,0.0,1.0,1.0,0.0,0.0,0.0,0.0,0.0,,0.0,0.0,9.0,3.0,3.0,,2.0,1.0,0.0,0.0,1.0,0.0,0.0,0.0,0.0,0.0,0.0,0.0,0.0,0.0,0.0,1.0,1.0,5.0,1.0,5.0,1.0,5.0,0.0,2.0,,,,,,,,,,,,,,,,,,,,,,,6.0,,0.0,0.0,,2.0
84.0,43.0,1.0,1.0,0.0,0.0,0.0,0.0,0.0,0.0,1.0,0.0,0.0,,0.0,0.0,11.0,3.0,3.0,20.0,2.0,1.0,1.0,0.0,1.0,0.0,0.0,0.0,0.0,0.0,0.0,0.0,0.0,0.0,1.0,1.0,2.0,15.0,2.0,15.0,2.0,15.0,,,0.0,3.0,0.0,3.0,0.0,2.0,0.0,3.0,0.0,2.0,0.0,2.0,,,,,,,,,,,10.0,,1.0,0.0,,1.0
37.0,58.0,1.0,1.0,0.0,0.0,0.0,0.0,0.0,1.0,1.0,0.0,0.0,,0.0,0.0,13.0,3.0,3.0,22.0,,0.0,0.0,0.0,0.0,0.0,0.0,0.0,0.0,0.0,0.0,0.0,0.0,0.0,0.0,1.0,0.0,2.0,0.0,3.0,0.0,3.0,0.0,2.0,,,,,,,,,,,,,,,,,,,,,,,7.0,,0.0,0.0,,1.0
38.0,54.0,1.0,0.0,0.0,0.0,0.0,0.0,0.0,0.0,0.0,1.0,0.0,,0.0,0.0,8.0,3.0,3.0,25.0,2.0,1.0,0.0,0.0,1.0,0.0,0.0,0.0,0.0,0.0,0.0,0.0,0.0,0.0,1.0,1.0,0.0,1.0,0.0,2.0,,,,,,,,,,,,,,,,,,,,,,,,,,,5.0,,0.0,0.0,,1.0
105.0,66.0,0.0,1.0,1.0,1.0,1.0,0.0,0.0,0.0,0.0,1.0,0.0,,0.0,0.0,30.0,3.0,3.0,,1.0,0.0,0.0,0.0,1.0,0.0,0.0,0.0,0.0,0.0,0.0,0.0,0.0,0.0,0.0,1.0,0.0,4.0,0.0,2.0,0.0,2.0,0.0,5.0,0.0,4.0,0.0,5.0,0.0,5.0,0.0,5.0,0.0,4.0,0.0,4.0,,,,,,,,,,,10.0,,1.0,0.0,,2.0
13.0,79.0,0.0,1.0,0.0,0.0,1.0,0.0,0.0,1.0,0.0,1.0,0.0,,0.0,0.0,17.0,3.0,3.0,,1.0,1.0,0.0,0.0,1.0,0.0,0.0,0.0,0.0,0.0,0.0,1.0,1.0,0.0,0.0,1.0,0.0,2.0,0.0,2.0,0.0,2.0,0.0,2.0,0.0,2.0,,,,,,,0.0,2.0,0.0,2.0,0.0,2.0,0.0,2.0,0.0,1.0,0.0,1.0,0.0,1.0,17.0,0,0.0,0.0,,2.0
29.0,70.0,0.0,0.0,0.0,0.0,0.0,0.0,0.0,0.0,0.0,0.0,1.0,5.0,0.0,0.0,14.0,3.0,3.0,17.0,1.0,1.0,0.0,0.0,1.0,0.0,0.0,0.0,0.0,0.0,0.0,1.0,0.0,0.0,0.0,1.0,0.0,3.0,0.0,3.0,0.0,2.0,,,,,,,,,,,,,,,,,,,,,,,,,4.0,,0.0,1.0,dry cough,2.0
91.0,71.0,0.0,0.0,0.0,0.0,0.0,0.0,0.0,0.0,0.0,0.0,1.0,20.0,0.0,0.0,14.0,3.0,3.0,18.0,2.0,1.0,1.0,0.0,0.0,0.0,0.0,1.0,0.0,0.0,0.0,1.0,0.0,0.0,1.0,1.0,0.0,2.0,0.0,2.0,0.0,2.0,0.0,2.0,0.0,2.0,0.0,2.0,,,,,,,,,,,,,,,,,,,6.0,,1.0,1.0,shortness of breath,2.0
39.0,70.0,1.0,0.0,0.0,0.0,0.0,0.0,0.0,0.0,0.0,0.0,1.0,12.5,0.0,0.0,7.0,1.0,3.0,22.0,5.0,1.0,1.0,0.0,1.0,0.0,0.0,0.0,0.0,0.0,1.0,1.0,0.0,0.0,0.0,1.0,4.0,,4.0,,4.0,,4.0,,4.0,,4.0,,4.0,,2.0,10.0,2.0,10.0,2.0,8.0,1.0,5.0,1.0,5.0,1.0,5.0,0.0,2.0,0.0,2.0,25.0,,0.0,0.0,,2.0
41.0,65.0,1.0,1.0,1.0,1.0,0.0,0.0,0.0,0.0,0.0,0.0,1.0,10.0,0.0,0.0,10.0,3.0,3.0,25.0,5.0,1.0,0.0,0.0,1.0,0.0,0.0,1.0,0.0,0.0,0.0,1.0,0.0,0.0,0.0,1.0,2.0,12.0,2.0,10.0,2.0,12.0,2.0,12.0,2.0,12.0,2.0,10.0,4.0,,4.0,,4.0,,4.0,,2.0,10.0,2.0,10.0,1.0,5.0,1.0,5.0,1.0,5.0,30.0,,1.0,1.0,"cough, shortness of breath",2.0
23.0,78.0,1.0,1.0,0.0,0.0,1.0,0.0,0.0,0.0,0.0,0.0,1.0,15.0,1.0,0.0,19.0,2.0,3.0,23.0,2.0,1.0,0.0,0.0,1.0,0.0,0.0,0.0,0.0,0.0,1.0,0.0,0.0,0.0,1.0,1.0,1.0,5.0,1.0,5.0,0.0,3.0,0.0,3.0,0.0,3.0,0.0,2.0,0.0,2.0,0.0,1.0,,,,,,,,,,,,,,,10.0,,1.0,0.0,,2.0
100.0,71.0,1.0,1.0,1.0,0.0,1.0,0.0,0.0,0.0,0.0,0.0,1.0,20.0,1.0,0.0,16.0,3.0,3.0,22.0,5.0,1.0,1.0,1.0,1.0,1.0,0.0,0.0,0.0,0.0,0.0,1.0,0.0,1.0,0.0,1.0,3.0,20.0,3.0,20.0,3.0,20.0,3.0,20.0,3.0,20.0,3.0,20.0,4.0,,4.0,,4.0,,4.0,,2.0,,1.0,,1.0,,0.0,,0.0,,10.0,hypoxic respiraatory failure and death,1.0,1.0,,2.0
54.0,82.0,1.0,1.0,1.0,1.0,0.0,0.0,0.0,0.0,0.0,0.0,0.0,,0.0,1.0,10.0,0.0,0.0,,0.0,1.0,0.0,0.0,0.0,0.0,0.0,0.0,0.0,0.0,0.0,0.0,0.0,0.0,0.0,1.0,0.0,2.0,0.0,1.0,,,,,,,,,,,,,,,,,,,,,,,,,,,3.0,,0.0,0.0,,2.0
66.0,70.0,0.0,1.0,1.0,1.0,1.0,1.0,0.0,0.0,0.0,1.0,0.0,,0.0,1.0,24.0,3.0,0.0,2.0,1.0,1.0,0.0,0.0,0.0,0.0,0.0,0.0,0.0,0.0,0.0,1.0,0.0,0.0,0.0,1.0,1.0,5.0,1.0,5.0,,,,,,,,,,,,,,,,,,,,,,,,,,,4.0,,0.0,0.0,,2.0
95.0,72.0,1.0,1.0,0.0,0.0,1.0,0.0,0.0,0.0,0.0,0.0,1.0,20.0,0.0,1.0,10.0,0.0,0.0,,0.0,1.0,0.0,0.0,1.0,0.0,0.0,1.0,0.0,0.0,0.0,1.0,0.0,0.0,0.0,1.0,0.0,1.0,0.0,1.0,,,,,,,,,,,,,,,,,,,,,,,,,,,2.0,,1.0,1.0,SOB,2.0